{"text_format":"1","workbook":"xlsx","n_sheets":5,"sheets":["HP入口","入力シート","算出シート","読込","掛金率"],"not_rendered":{"charts":0,"images":11,"macros":1,"external_links":1,"defined_names":2,"comments":1,"pivot_tables":0},"unopened":[],"bounds":{"document_bytes":16777216,"sheet_cells":100000,"rows_first":2000,"rows_last":500,"rows_between":2000,"halvings":0,"cell_chars":16384,"cell_head_chars":4096},"cells_cut":0,"cells_raw":0,"read":"whole","date_system":"1900"}

{"sheet":"HP入口","index":0,"n_rows":0,"n_cols":0,"rows_kept":0,"cut":false,"hidden":true,"merged":[]}

{"sheet":"入力シート","index":1,"n_rows":67,"n_cols":29,"rows_kept":67,"cut":false,"hidden":false,"merged":[[51,2,52,20],[53,5,54,9],[53,10,54,11],[50,27,50,34],[44,2,44,17],[44,19,44,35],[46,5,47,9],[46,10,47,11],[46,22,47,26],[46,27,47,28],[29,4,30,14],[29,15,30,16],[37,2,37,17],[37,19,37,35],[39,5,40,9],[39,10,40,11],[39,22,40,26],[39,27,40,28],[18,2,19,3],[18,4,19,34],[21,4,22,14],[21,15,22,16],[26,2,27,3],[26,4,27,20],[0,0,1,34],[2,0,3,34],[13,4,14,10],[13,12,14,15],[13,21,14,21],[13,22,14,23],[13,24,14,25],[13,26,14,27],[13,28,14,29]]}
[]
[]
["（令和４年１月以降の料率を適用）"]
[]
[]
[]
[]
[]
[]
[]
["【あなたの申告方法等を入力ください】"]
[null,null,"①申告方法・経営形態は何ですか？",null,null,null,null,null,null,null,null,null,null,null,null,null,null,null,null,"②保険開始月は、いつですか？"]
[null,null,null,null,null,null,null,null,null,null,null,null,null,null,null,null,null,null,null,null,"（個人は、１月ｽﾀｰﾄ）"]
[null,null,null,null,"青色申告（簡易）",null,null,null,null,null,null,null,"個人",null,null,null,null,null,null,null,null,"R",5,null,"年",null,1,null,"月"]
[]
[null,null,null,null,null,null,null,null,null,null,null,null,null,null,null,null,null,null,null,null,null,"※法人は、税の会計期間＝保険期間（１年間）"]
[]
["【基準収入の入力について】"]
[null,null,"③",null,"翌期(保険期間中)の農産物の販売収入は、どのくらいを見込んでいますか？　（目標販売金額）"]
[]
[]
[null,null,null,null,1000000,null,null,null,null,null,null,null,null,null,null,"円"]
[]
[null,null,null,null,"※補償内容は、最大補償を選択しています。"]
[]
["【もし、保険期間中の収入が減少したら？被害を想定して販売収入を入力してみましょう？】"]
[null,null,"④",null,"減収した農業収入金額を入力してみましょう"]
[]
[]
[null,null,null,null,400000,null,null,null,null,null,null,null,null,null,null,"円"]
[]
[]
[]
[]
[]
[]
[null,"【保険方式】"]
[null,null,"1.保険方式(掛捨て部分)の補償限度額は？",null,null,null,null,null,null,null,null,null,null,null,null,null,null,null,null,"2.保険方式(掛捨て部分)の支払率は？"]
[]
[null,null,null,null,null,80,null,null,null,null,"％",null,null,null,null,null,null,null,null,null,null,null,90,null,null,null,null,"％"]
[]
[]
[]
[null,"【積立方式】※こちらはオプションのため、『選択しない』を選ぶことも可能です。"]
[null,null,"3.積立方式(積立て部分)の補償幅は？",null,null,null,null,null,null,null,null,null,null,null,null,null,null,null,null,"4.積立方式(積立て部分)の支払率は？"]
[]
[null,null,null,null,null,10,null,null,null,null,{"$f":"IF(F47=\"選択なし\",\"\",\"％\")","v":"％"},null,null,null,null,null,null,null,null,null,null,null,90,null,null,null,null,{"$f":"IF(W47=\"設定なし\",\"\",\"％\")","v":"％"}]
[]
[]
[]
[null,"【補償の下限の設定について】",null,null,null,null,null,null,null,null,null,null,null,null,null,null,null,null,null,null,null,null,null,null,null,null,null,"≪補償イメージ図≫"]
[null,null,"⑨保険方式の補償限度に下限(補償しない部分)を\n　　設定しますか？"]
[]
[null,null,null,null,null,"設定なし",null,null,null,null,{"$f":"IF(F54=\"設定なし\",\"\",\"％\")","v":""}]
[]
[]
[]
[]
[]
[]
[]
[]
[]
[]
[]
[null,"簡易シミュレーションになりますので、"]
[null,"詳しくは、最寄りのNOSAIまでお問い合わせください！"]

{"sheet":"算出シート","index":2,"n_rows":69,"n_cols":32,"rows_kept":69,"cut":false,"hidden":false,"merged":[[35,0,36,5],[59,17,59,22],[68,17,68,21],[67,2,67,4],[67,6,67,8],[67,10,67,14],[67,15,67,16],[67,17,67,21],[68,2,68,4],[68,6,68,8],[68,10,68,14],[68,15,68,16],[66,17,66,21],[65,2,65,4],[65,6,65,8],[65,10,65,14],[65,15,65,16],[65,17,65,21],[66,2,66,4],[66,6,66,8],[66,10,66,14],[66,15,66,16],[64,17,64,21],[63,2,63,4],[63,6,63,8],[63,10,63,14],[63,15,63,16],[63,17,63,21],[64,2,64,4],[64,6,64,8],[64,10,64,14],[64,15,64,16],[62,15,62,16],[62,17,62,21],[61,2,61,4],[61,6,61,8],[61,10,61,14],[61,15,61,16],[61,17,61,21],[62,2,62,4],[62,6,62,8],[62,10,62,14],[60,2,60,4],[60,6,60,8],[60,10,60,14],[60,15,60,16],[60,17,60,21],[23,5,24,5],[25,5,26,21],[9,2,9,5],[58,1,59,1],[58,2,59,5],[59,6,59,9],[59,10,59,16],[57,10,57,13],[45,12,45,19],[37,0,38,8],[39,0,39,8],[38,12,39,18],[40,0,40,8],[41,0,41,8],[40,12,41,18],[42,1,42,3],[42,5,42,7],[1,28,1,30],[8,0,10,0],[1,23,1,25],[29,0,34,0],[22,15,22,17],[13,2,14,5],[13,0,14,0],[29,13,30,18],[31,13,32,18],[33,13,34,18],[33,11,34,12],[31,2,32,5],[33,2,34,5],[29,1,30,1],[31,11,32,12],[18,7,18,9],[12,9,13,12],[12,13,13,20],[18,15,18,17],[13,7,14,7],[0,0,1,21],[8,9,9,12],[5,9,5,12],[8,13,9,20],[5,13,5,19],[2,17,2,20],[2,7,2,13],[29,8,30,12],[31,1,32,1],[29,2,30,5],[31,8,34,10],[33,1,34,1]]}
["農業経営収入保険　保険料等試算シート　料率改定版\n（令和5年加入申請時）",null,null,null,null,null,null,null,null,null,null,null,null,null,null,null,null,null,null,null,null,null,null,"仮に、保険加入後の農業収入が",null,null,null,null,"受け取れる金額は…"]
[null,null,null,null,null,null,null,null,null,null,null,null,null,null,null,null,null,null,null,null,null,null,null,{"$f":"入力シート!E30","v":400000},null,null,"円　とすると…",null,{"$f":"IF(読込!P21<=0,0,IF(X2=\"\",\"\",IF(読込!P21>=算出シート!M41,算出シート!M41,読込!P21)))","v":450000},null,null,"円"]
[null,null,null,null,null,null,null,"　　　  自動継続特約あり",null,null,null,null,null,null,null,null,null,"継続加入",null,null,null,null,null,null,null,null,null,null,null,"基準収入金額："]
[]
[]
["始期年月","令和",5,null,"年",1,null,"月",null,"氏名",null,null,null,"共済　太郎",null,null,null,null,null,null,"様"]
[]
[]
["申告の\n種類",null,null,null,null,null,null,null,null,"住所",null,null,null,"上尾市大字西門前523-1"]
[null,null,"青色申告（複式）"]
[]
[]
[null,null,null,null,null,null,null,null,null,"連絡先",null,null,null,"048-779-6911"]
["基準金額",null,{"$f":"入力シート!E22","v":1000000},null,null,null,null,"円"]
[]
[]
[]
[]
["保険方式","補償割合",{"$f":"入力シート!F40","v":80},null,null,"補償割合\n（下限）",null,{"$f":"入力シート!F54","v":"設定なし"},null,null,null,null,null,"支払率",null,{"$f":"入力シート!W40","v":90}]
[]
[]
[]
["積立方式","補償幅",{"$f":"入力シート!F47","v":10},null,null,null,null,null,null,null,null,null,null,"支払率",null,{"$f":"入力シート!W47","v":90}]
[null,null,null,null,null,{"$f":"IF(OR(OR(AND($P$23>50,$P$19=50),AND($P$23>60,$P$19=60),AND($P$23>70,$P$19=70),AND($P$23>80,$P$19=80)),OR(AND($C$19<=70,$H$19=70), AND($C$19<=60,$H$19=60), AND($C$19=50,$H$19=50))),\"エラー！\",\"\")","v":""}]
[]
[null,null,null,null,null,{"$f":"IF(OR(AND($P$23>50,$P$19=50),AND($P$23>60,$P$19=60),AND($P$23>70,$P$19=70),AND($P$23>80,$P$19=80)),\"積立方式の支払率は、保険方式の支払率以下で設定してください。\",IF(OR(AND($C$19<=70,$H$19=70),AND($C$19<=60,$H$19=60),AND($C$19=50,$H$19=50)),\"下限設定は、保険方式未満の割合で設定してください。\",\"\"))","v":""}]
["保険料率",0,{"$f":"VLOOKUP(掛金率!A2,掛金率!A7:C384,3,FALSE)","v":2.46}]
[]
[]
["納入金額\n（年額）","保険料",{"$f":"INT(PRODUCT(INT(INT(C14*C19*0.01)*P19*0.01),C27,0.01))-INT(PRODUCT(INT(INT(C14*C19*0.01)*P19*0.01),C27,0.01,0.5))","v":8856},null,null,null,null,null,"合計",null,null,null,null,{"$f":"C30+C32+C34","v":15138}]
[null,null,null,null,null,null,null,"円",null,null,null,null,null,null,null,null,null,null,null,"円"]
[null,"付加保険料\n（事務費）",{"$f":"IF(読込!D14=TRUE,IF(読込!G14=TRUE,読込!D18,読込!C18),読込!B18)","v":6282},null,null,null,null,null,"経理処理",null,null,"経費",null,{"$f":"C30+C32","v":15138}]
[null,null,null,null,null,null,null,"円",null,null,null,null,null,null,null,null,null,null,null,"円"]
[null,"積立金",{"$f":"IFERROR(VLOOKUP(読込!A34,読込!B34:C35,2,FALSE),\" \")","v":0},null,null,null,null,null,null,null,null,"預け金",null,{"$f":"読込!C34","v":22500}]
[null,null,null,null,null,null,null,"円",null,null,null,null,null,null,null,null,null,null,null,"円"]
["※　上記金額には誤差が出る場合がございますので、あらかじめご了承願います。"]
[]
["補てん限度額※図参照"]
[null,null,null,null,null,null,null,null,null,null,null,null,{"$f":"IF(C23=\"選択なし\",INT(C14*C19*0.01),INT(C14*C23*0.01)+INT(C14*C19*0.01))","v":900000}]
["（下回ると補てん金の対象となる金額）",null,null,null,null,null,null,null,null,null,null,null,null,null,null,null,null,null,null,null,"円"]
["補償金額",null,null,null,null,null,null,null,null,null,null,null,{"$f":"IF(C23=\"選択なし\",INT((算出シート!C14*(算出シート!C19-IF(H19=\"設定なし\",0,H19))*0.01)*算出シート!P19*0.01),INT((算出シート!C14*算出シート!C23*0.01)*算出シート!P23*0.01)+INT((算出シート!C14*(算出シート!C19-IF(H19=\"設定なし\",0,H19))*0.01)*算出シート!P19*0.01))","v":810000}]
["（補償される最高金額）",null,null,null,null,null,null,null,null,null,null,null,null,null,null,null,null,null,null,null,"円"]
[]
[]
[]
["上記試算したことを、ここに証明します。",null,null,null,null,null,null,null,null,null,null,null,{"$f":"TODAY()","v":"2022-06-06"}]
[]
["　　埼玉県農業共済組合",null,null,null,null,null,null,null,null,null,"　担当職員："]
[]
[]
[]
[]
[]
[]
[]
[]
[]
[null,"振替年月日及び支払金額",null,null,null,null,null,"分割回数",null,null,"９回"]
[null,"年月","支払金額"]
[null,null,null,null,null,null,"保険料",null,null,null,"積立金",null,null,null,null,null,null,"付加保険料"]
[null,{"$f":"読込!L3","v":"2022-12-01"},{"$f":"SUM(G61,K61,R61)","v":7266},null,null,"円",{"$f":"IF(K58=\"一括支払\",C30,C30-SUM(G62:I69))","v":984},null,null,"円",{"$f":"IF(K58=\"一括支払\",C34,C34-SUM(K62:O69))","v":0},null,null,null,null,"円",null,{"$f":"C32","v":6282},null,null,null,null,"円"]
[null,{"$f":"IF($K$58=\"９回\",EDATE(B61,1),IF($K$58=\"５回\",EDATE(B61,2),IF($K$58=\"３回\",EDATE(B61,4),IF($K$58=\"２回\",EDATE(B61,8),\"\"))))","v":"2023-01-01"},{"$f":"IF(OR($K$58=\"９回\",$K$58=\"５回\",$K$58=\"３回\",$K$58=\"２回\"),SUM(G62,K62,R62),\"\")","v":984},null,null,"円",{"$f":"IF(OR($K$58=\"９回\",$K$58=\"５回\",$K$58=\"３回\",$K$58=\"２回\"),INT($C$30/VLOOKUP($K$58,読込!$H$3:$I$7,2,FALSE)),\"\")","v":984},null,null,"円",{"$f":"IF(OR($K$58=\"９回\",$K$58=\"５回\",$K$58=\"３回\",$K$58=\"２回\"),INT($C$34/VLOOKUP($K$58,読込!$H$3:$I$7,2,FALSE)),\"\")","v":0},null,null,null,null,"円",null,null,null,null,null,null,"円"]
[null,{"$f":"IF($K$58=\"９回\",EDATE(B62,1),IF($K$58=\"５回\",EDATE(B62,2),IF($K$58=\"３回\",EDATE(B62,4),\"\")))","v":"2023-02-01"},{"$f":"IF(OR($K$58=\"９回\",$K$58=\"５回\",$K$58=\"３回\"),SUM(G63,K63,R63),\"\")","v":984},null,null,"円",{"$f":"IF(OR($K$58=\"９回\",$K$58=\"５回\",$K$58=\"３回\"),INT($C$30/VLOOKUP($K$58,読込!$H$3:$I$7,2,FALSE)),\"\")","v":984},null,null,"円",{"$f":"IF(OR($K$58=\"９回\",$K$58=\"５回\",$K$58=\"３回\"),INT($C$34/VLOOKUP($K$58,読込!$H$3:$I$7,2,FALSE)),\"\")","v":0},null,null,null,null,"円",null,null,null,null,null,null,"円"]
[null,{"$f":"IF($K$58=\"９回\",EDATE(B63,1),IF($K$58=\"５回\",EDATE(B63,2),\"\"))","v":"2023-03-01"},{"$f":"IF(OR($K$58=\"９回\",$K$58=\"５回\"),SUM(G64,K64,R64),\"\")","v":984},null,null,"円",{"$f":"IF(OR($K$58=\"９回\",$K$58=\"５回\"),INT($C$30/VLOOKUP($K$58,読込!$H$3:$I$7,2,FALSE)),\"\")","v":984},null,null,"円",{"$f":"IF(OR($K$58=\"９回\",$K$58=\"５回\"),INT($C$34/VLOOKUP($K$58,読込!$H$3:$I$7,2,FALSE)),\"\")","v":0},null,null,null,null,"円",null,null,null,null,null,null,"円"]
[null,{"$f":"IF($K$58=\"９回\",EDATE(B64,1),IF($K$58=\"５回\",EDATE(B64,2),\"\"))","v":"2023-04-01"},{"$f":"IF(OR($K$58=\"９回\",$K$58=\"５回\"),SUM(G65,K65,R65),\"\")","v":984},null,null,"円",{"$f":"IF(OR($K$58=\"９回\",$K$58=\"５回\"),INT($C$30/VLOOKUP($K$58,読込!$H$3:$I$7,2,FALSE)),\"\")","v":984},null,null,"円",{"$f":"IF(OR($K$58=\"９回\",$K$58=\"５回\"),INT($C$34/VLOOKUP($K$58,読込!$H$3:$I$7,2,FALSE)),\"\")","v":0},null,null,null,null,"円",null,null,null,null,null,null,"円"]
[null,{"$f":"IF($K$58=\"９回\",EDATE(B65,1),\"\")","v":"2023-05-01"},{"$f":"IF($K$58=\"９回\",SUM(G66,K66,R66),\"\")","v":984},null,null,"円",{"$f":"IF($K$58=\"９回\",INT($C$30/VLOOKUP($K$58,読込!$H$3:$I$7,2,FALSE)),\"\")","v":984},null,null,"円",{"$f":"IF($K$58=\"９回\",INT($C$34/VLOOKUP($K$58,読込!$H$3:$I$7,2,FALSE)),\"\")","v":0},null,null,null,null,"円",null,null,null,null,null,null,"円"]
[null,{"$f":"IF($K$58=\"９回\",EDATE(B66,1),\"\")","v":"2023-06-01"},{"$f":"IF($K$58=\"９回\",SUM(G67,K67,R67),\"\")","v":984},null,null,"円",{"$f":"IF($K$58=\"９回\",INT($C$30/VLOOKUP($K$58,読込!$H$3:$I$7,2,FALSE)),\"\")","v":984},null,null,"円",{"$f":"IF($K$58=\"９回\",INT($C$34/VLOOKUP($K$58,読込!$H$3:$I$7,2,FALSE)),\"\")","v":0},null,null,null,null,"円",null,null,null,null,null,null,"円"]
[null,{"$f":"IF($K$58=\"９回\",EDATE(B67,1),\"\")","v":"2023-07-01"},{"$f":"IF($K$58=\"９回\",SUM(G68,K68,R68),\"\")","v":984},null,null,"円",{"$f":"IF($K$58=\"９回\",INT($C$30/VLOOKUP($K$58,読込!$H$3:$I$7,2,FALSE)),\"\")","v":984},null,null,"円",{"$f":"IF($K$58=\"９回\",INT($C$34/VLOOKUP($K$58,読込!$H$3:$I$7,2,FALSE)),\"\")","v":0},null,null,null,null,"円",null,null,null,null,null,null,"円"]
[null,{"$f":"IF($K$58=\"９回\",EDATE(B68,1),\"\")","v":"2023-08-01"},{"$f":"IF($K$58=\"９回\",SUM(G69,K69,R69),\"\")","v":984},null,null,"円",{"$f":"IF($K$58=\"９回\",INT($C$30/VLOOKUP($K$58,読込!$H$3:$I$7,2,FALSE)),\"\")","v":984},null,null,"円",{"$f":"IF($K$58=\"９回\",INT($C$34/VLOOKUP($K$58,読込!$H$3:$I$7,2,FALSE)),\"\")","v":0},null,null,null,null,"円",null,null,null,null,null,null,"円"]

{"sheet":"読込","index":3,"n_rows":35,"n_cols":30,"rows_kept":35,"cut":false,"hidden":true,"merged":[[23,0,23,1],[23,2,23,3],[32,0,32,2]]}
["加入方式等ドロップダウンリスト",null,null,null,null,null,null,null,null,null,null,null,null,null,null,null,null,null,null,null,null,null,null,null,null,null,null,null,"開始月","開始年"]
["限度額区分","積立金","支払率","下限","申告の種類",null,null,"支払回数",null,null,"引き落とし月表示",null,null,null,null,null,null,null,null,null,null,null,null,null,null,null,null,null,1,4]
[80,10,90,"設定なし","青色申告（複式）",null,null,"９回",9,null,"1回目",{"$f":"DATE(算出シート!C6+2018,算出シート!F6-1,1)","v":"2022-12-01"},null,null,null,null,null,null,null,null,null,null,null,null,null,null,null,null,2,5]
[78,5,80,50,"青色申告（簡易）",null,null,"５回",5,null,null,null,null,null,null,null,null,null,null,null,null,null,null,null,null,null,null,null,3,6]
[75,"選択なし",70,60,"白色申告",null,null,"３回",3,null,null,null,null,null,null,null,null,null,null,null,null,null,null,null,null,null,null,null,4,7]
[70,null,60,70,"青色申告（現金主義）",null,null,"２回",2,null,null,null,null,null,null,null,null,null,null,null,null,null,null,null,null,null,null,null,5,8]
[60,null,50,null,null,null,null,"一括",1,null,null,null,null,null,null,null,null,null,null,null,null,null,null,null,null,null,null,null,6,9]
[50,null,40,null,null,null,null,null,null,null,null,null,null,null,null,null,null,null,null,null,null,null,null,null,null,null,null,null,7,10]
[null,null,30,null,null,null,null,null,null,null,null,null,null,null,null,null,null,null,null,null,null,null,null,null,null,null,"青色申告","個人",8,11]
[null,null,20,null,null,null,null,null,null,null,null,null,null,null,null,null,null,null,null,null,null,null,null,null,null,null,"白色申告","法人",9,12]
[null,null,10,null,null,null,null,null,null,null,null,null,null,null,null,null,null,null,null,null,null,null,null,null,null,null,null,null,10,13]
[null,null,null,null,null,null,null,null,null,null,null,null,null,null,null,null,null,null,null,null,null,null,null,null,null,null,null,null,11,14]
["加入区分",null,"継続加入割引",null,null,"自動継続特約付与",null,null,null,null,null,null,null,null,null,null,null,null,null,null,null,null,null,null,null,null,null,null,12,15]
["新規加入",null,"継続加入区分",false,null,"自動継続特約",false]
["継続加入"]
[null,null,null,null,null,null,null,null,"グラフ文字表示",{"$f":"\"      農業収入      \"","v":"      農業収入      "},null,"農業収入表示",{"$f":"IF(OR(算出シート!X2=読込!P20,算出シート!X2=P19,算出シート!X2=P18,算出シート!X2=P17),\"\",算出シート!X2)","v":400000},null,"積立割合",{"$f":"IF(算出シート!C23=\"選択なし\",\"\",算出シート!C19+算出シート!C23)","v":90},"保険割合",{"$f":"算出シート!$C$19","v":80},"下限設定",{"$f":"IF(算出シート!$H$19=\"設定なし\",\"\",算出シート!$H$19)","v":""}]
[null,"初年度割あり","初年度割なし","自動継続特約あり",null,null,null,null,null,{"$f":"IF(算出シート!C23=\"選択なし\",\"\",\"　　積立方式 \")","v":"　　積立方式 "},null,null,null,null,"基準収入",{"$f":"算出シート!C14","v":1000000}]
["付加保険料計算",{"$f":"IF(算出シート!C14=0,0,INT(IF(VLOOKUP(算出シート!H19,読込!A19:B22,2,FALSE)>=300000,255000+(VLOOKUP(算出シート!H19,読込!A19:B22,2,FALSE)-300000)*0.3,IF(VLOOKUP(算出シート!H19,読込!A19:B22,2,FALSE)>=150000,150000+(VLOOKUP(算出シート!H19,読込!A19:B22,2,FALSE)-150000)*0.7,VLOOKUP(算出シート!H19,読込!A19:B22,2,FALSE)))))","v":6282},{"$f":"IF(算出シート!C14=0,0,INT(IF(VLOOKUP(算出シート!H19,読込!A19:C22,3,FALSE)>=300000,255000+(VLOOKUP(算出シート!H19,読込!A19:C22,3,FALSE)-300000)*0.3,IF(VLOOKUP(算出シート!H19,読込!A19:C22,3,FALSE)>=150000,150000+(VLOOKUP(算出シート!H19,読込!A19:C22,3,FALSE)-150000)*0.7,VLOOKUP(算出シート!H19,読込!A19:C22,3,FALSE)))))","v":4982},{"$f":"C18-1000","v":3982},null,null,null,null,null,{"$f":"IF(算出シート!$H$19=\"設定なし\",\"　保険方式 　\",\"　保険方式 　\")","v":"　保険方式 　"},null,null,{"$f":"IF(算出シート!$C$23=\"選択なし\",\"\",\"補てん限度額：下回ると補償が発動します\")","v":"補てん限度額：下回ると補償が発動します"},null,"補填限度額",{"$f":"IF(算出シート!C23=\"選択なし\",\"\",(INT(P17*算出シート!C23*0.01)+INT(P17*算出シート!C19*0.01)))","v":900000}]
["設定なし",{"$f":"IF(算出シート!C23=\"選択なし\",INT(INT(INT(算出シート!C14*算出シート!C19*0.01)*算出シート!P19*0.01)*22/10000)+4500,INT((INT(INT(算出シート!C14*算出シート!C19*0.01)*算出シート!P19*0.01)+(INT(INT(算出シート!C14*算出シート!C23*0.01)*算出シート!P23*0.01)))*22/10000)+4500)","v":6282},{"$f":"B19-1300","v":4982},null,null,null,null,null,null,{"$f":"IF(算出シート!H19=\"設定なし\",\"\",IF(読込!P20<=算出シート!X2,\"\",\"補償対象外\"))","v":""},null,null,{"$f":"IF(算出シート!$C$23=\"選択なし\",\"補てん限度額：下回ると補償が発動します\",\"\")","v":""},null,"保険限度額",{"$f":"INT(P17*(算出シート!C19)/100)","v":800000}]
[50,{"$f":"IF(算出シート!C23=\"選択なし\",INT(INT(INT(算出シート!C14*算出シート!C19*0.01)*算出シート!P19*0.01)*21/10000)+4500,INT((INT(INT(算出シート!C14*算出シート!C19*0.01)*算出シート!P19*0.01)+(INT(INT(算出シート!C14*算出シート!C23*0.01)*算出シート!P23*0.01)))*21/10000)+4500)","v":6201},{"$f":"B20-1300","v":4901},null,null,null,null,null,null,{"$f":"IF(算出シート!H19=\"設定なし\",\"\",IF(読込!P20<=算出シート!X2,\"\",\"補償対象外\"))","v":""},null,null,{"$f":"IF(算出シート!$H$19=\"設定なし\",\"\",\"これより下は補償されません\")","v":""},null,"下限設定金額",{"$f":"IF(算出シート!H19=\"設定なし\",\"\",ROUNDUP(P17*VLOOKUP(算出シート!H19,読込!C25:D28,2,FALSE)/100,0))","v":""}]
[60,{"$f":"IF(算出シート!C23=\"選択なし\",INT(INT(INT(算出シート!C14*算出シート!C19*0.01)*算出シート!P19*0.01)*20/10000)+4500,INT((INT(INT(算出シート!C14*算出シート!C19*0.01)*算出シート!P19*0.01)+(INT(INT(算出シート!C14*算出シート!C23*0.01)*算出シート!P23*0.01)))*20/10000)+4500)","v":6120},4820,null,null,null,null,null,null,{"$f":"IF(算出シート!H19=\"設定なし\",\"\",IF(読込!P20=算出シート!X2,\"\",\"（下限設定）\"))","v":""},null,null,null,null,"受取金額",{"$f":"IF(算出シート!C23=\"選択なし\",INT((INT(算出シート!C14*算出シート!C19*0.01)-算出シート!X2)*算出シート!P19*0.01),IF((INT(算出シート!C14*算出シート!C23*0.01)+INT(算出シート!C14*算出シート!C19*0.01)-算出シート!X2)>INT(算出シート!C14*算出シート!C23*0.01),INT(INT(算出シート!C14*算出シート!C23*0.01)*算出シート!P23*0.01)+INT((INT(算出シート!C14*算出シート!C19*0.01)-算出シート!X2)*算出シート!P19*0.01),INT(((INT(算出シート!C14*算出シート!C23*0.01)+INT(算出シート!C14*算出シート!C19*0.01))-算出シート!X2)*算出シート!P23*0.01)))","v":450000}]
[70,{"$f":"IF(算出シート!C23=\"選択なし\",INT(INT(INT(算出シート!C14*算出シート!C19*0.01)*算出シート!P19*0.01)*18/10000)+4500,INT((INT(INT(算出シート!C14*算出シート!C19*0.01)*算出シート!P19*0.01)+(INT(INT(算出シート!C14*算出シート!C23*0.01)*算出シート!P23*0.01)))*18/10000)+4500)","v":5958},4658]
[null,null,null,null,null,null,null,"グラフ作成数値",null,"上",null,"下"]
["積立金",null,"下限",null,null,null,null,null,"自己負担部分","参照値",null,"参照値"]
[10,10,"設定なし",0,null,null,null,null,{"$f":"100-算出シート!$C$19-+算出シート!$C$23","v":10},"自己負担",{"$f":"(675-(M26)-M27)","v":90},"自己負担",{"$f":"(675-(M26)-M27)","v":90},null,250,"積立文字縦",{"$f":"M26/2.6","v":34.615384615384613},"積立文字横幅",{"$f":"O26-(O26/22)","v":214.77272727272728}]
[5,5,50,50,null,null,null,null,null,"積立",{"$f":"VLOOKUP(算出シート!$C$23,A25:B27,2,FALSE)*10*0.9","v":90},"積立",{"$f":"VLOOKUP(算出シート!$C$23,A25:B27,2,FALSE)*10*0.9","v":90},"支払率",{"$f":"算出シート!$P$23*2.5","v":225},"積立自己負担",{"$f":"M26-(O26/30)","v":82.5},{"$f":"O26/4","v":56.25},"外",{"$f":"M26","v":90},{"$f":"+R26+R26/10","v":61.875}]
["選択なし",0,60,60,null,null,null,null,null,"保険",{"$f":"(算出シート!$C$19*10-500)*0.9+250*0.9","v":495},"保険",{"$f":"((算出シート!$C$19*10)-500)*0.9+250*0.9","v":495},null,{"$f":"算出シート!$P$19*2.5","v":225}]
[null,null,70,70,null,null,null,null,null,"保険表示",{"$f":"M27-N30-M29","v":315},"保険表示幅",{"$f":"IF(M30>M29,M27-M30,M27-M29)","v":315}]
[null,null,null,null,null,null,null,null,null,"保険期間農業収入",{"$f":"IF(算出シート!$X$2=\"\",0,IF((算出シート!$X$2/算出シート!$C$14*1000)>=500,((算出シート!$X$2/算出シート!$C$14*1000)-500)*0.9+225,算出シート!$X$2/算出シート!$C$14*500*0.9))","v":180},"保険期間農業収入",{"$f":"IF((算出シート!$X$2/算出シート!$C$14*1000)>=1000,675,IF(算出シート!$X$2=\"\",0,IF((算出シート!$X$2/算出シート!$C$14*1000)>=500,((算出シート!$X$2/算出シート!$C$14*1000)-500)*0.9+225,算出シート!$X$2/算出シート!$C$14*500*0.9)))","v":180},null,250,"テキスト表示",{"$f":"IF(M29=0,0,IF(M29<30,M29,30))","v":30}]
[null,null,null,null,null,null,null,null,null,"下限",{"$f":"IF(算出シート!H19=\"設定なし\",0,((VLOOKUP(算出シート!H19,読込!C25:D28,2,FALSE))*10-500))*0.9+IF(算出シート!H19=\"設定なし\",0,250*0.9)-M29","v":-180},"下限",{"$f":"IF(算出シート!H19=\"設定なし\",0,((VLOOKUP(算出シート!H19,読込!C25:D28,2,FALSE))*10-500))*0.9+IF(算出シート!H19=\"設定なし\",0,250*0.9)","v":0},{"$f":"IF(M30<=0,0,M30)","v":0}]
[null,null,null,null,null,null,null,null,null,null,null,"補償対象外文字",{"$f":"M30-M29","v":-180}]
[null,null,null,null,null,null,null,null,null,null,null,{"$f":"IF(算出シート!C23=\"選択なし\",\"\",\"積立方式\")","v":"積立方式"}]
["積立継続計算フラグ"]
[2,1,{"$f":"IF(算出シート!C23=\"選択なし\",0,ROUNDUP(PRODUCT(PRODUCT(INT(INT(算出シート!C14*算出シート!C23*0.01)*算出シート!P23*0.01)),0.25),0))","v":22500}]
[null,2,0]

{"sheet":"掛金率","index":4,"n_rows":384,"n_cols":7,"rows_kept":384,"cut":false,"hidden":true,"merged":[[3,1,5,1]]}
[]
[{"$f":"算出シート!C19&\",\"&算出シート!H19&\",\"&算出シート!B27","v":"80,設定なし,0"},0.8,"保険方式の補償限度"]
[null,"設定なし","保険方式の補償の下限",null,null,null,10]
[null,"危険段階区分","危険段階別",null,null,null,9]
[null,null,"保険料率",null,null,null,8]
[null,null,"（％）",null,null,null,7]
["80,設定なし,10",10,5.2480000000000002,null,null,null,6]
["80,設定なし,9",9,3.5459999999999998,null,null,null,5]
["80,設定なし,8",8,3.4249999999999998,null,{"$f":"VLOOKUP(A2,A7:C384,3,FALSE)","v":2.46},null,4]
["80,設定なし,7",7,3.3050000000000002,null,null,null,3]
["80,設定なし,6",6,3.1840000000000002,null,null,null,2]
["80,設定なし,5",5,3.0630000000000002,null,null,null,1]
["80,設定なし,4",4,2.9430000000000001,null,null,null,0]
["80,設定なし,3",3,2.8220000000000001,null,null,null,-1]
["80,設定なし,2",2,2.7010000000000001,null,null,null,-2]
["80,設定なし,1",1,2.581,null,null,null,-3]
["80,設定なし,0",0,2.46,null,null,null,-4]
["80,設定なし,-1",-1,2.339,null,null,null,-5]
["80,設定なし,-2",-2,2.2189999999999999,null,null,null,-6]
["80,設定なし,-3",-3,2.0979999999999999,null,null,null,-7]
["80,設定なし,-4",-4,1.9770000000000001,null,null,null,-8]
["80,設定なし,-5",-5,1.857,null,null,null,-9]
["80,設定なし,-6",-6,1.736,null,null,null,-10]
["80,設定なし,-7",-7,1.615]
["80,設定なし,-8",-8,1.4950000000000001]
["80,設定なし,-9",-9,1.3740000000000001]
["80,設定なし,-10",-10,1.23]
["78,設定なし,10",10,4.6420000000000003]
["78,設定なし,9",9,3.137]
["78,設定なし,8",8,3.03]
["78,設定なし,7",7,2.923]
["78,設定なし,6",6,2.8159999999999998]
["78,設定なし,5",5,2.71]
["78,設定なし,4",4,2.6030000000000002]
["78,設定なし,3",3,2.496]
["78,設定なし,2",2,2.3889999999999998]
["78,設定なし,1",1,2.2829999999999999]
["78,設定なし,0",0,2.1760000000000002]
["78,設定なし,-1",-1,2.069]
["78,設定なし,-2",-2,1.9630000000000001]
["78,設定なし,-3",-3,1.8560000000000001]
["78,設定なし,-4",-4,1.7490000000000001]
["78,設定なし,-5",-5,1.6419999999999999]
["78,設定なし,-6",-6,1.536]
["78,設定なし,-7",-7,1.429]
["78,設定なし,-8",-8,1.3220000000000001]
["78,設定なし,-9",-9,1.2150000000000001]
["78,設定なし,-10",-10,1.0880000000000001]
["75,設定なし,10",10,3.859]
["75,設定なし,9",9,2.6080000000000001]
["75,設定なし,8",8,2.5190000000000001]
["75,設定なし,7",7,2.4300000000000002]
["75,設定なし,6",6,2.3410000000000002]
["75,設定なし,5",5,2.2530000000000001]
["75,設定なし,4",4,2.1640000000000001]
["75,設定なし,3",3,2.0750000000000002]
["75,設定なし,2",2,1.986]
["75,設定なし,1",1,1.8979999999999999]
["75,設定なし,0",0,1.8089999999999999]
["75,設定なし,-1",-1,1.72]
["75,設定なし,-2",-2,1.6319999999999999]
["75,設定なし,-3",-3,1.5429999999999999]
["75,設定なし,-4",-4,1.454]
["75,設定なし,-5",-5,1.365]
["75,設定なし,-6",-6,1.2769999999999999]
["75,設定なし,-7",-7,1.1879999999999999]
["75,設定なし,-8",-8,1.099]
["75,設定なし,-9",-9,1.01]
["75,設定なし,-10",-10,0.90500000000000003]
["70,設定なし,10",10,2.85]
["70,設定なし,9",9,1.9259999999999999]
["70,設定なし,8",8,1.86]
["70,設定なし,7",7,1.7949999999999999]
["70,設定なし,6",6,1.7290000000000001]
["70,設定なし,5",5,1.6639999999999999]
["70,設定なし,4",4,1.5980000000000001]
["70,設定なし,3",3,1.5329999999999999]
["70,設定なし,2",2,1.4670000000000001]
["70,設定なし,1",1,1.4019999999999999]
["70,設定なし,0",0,1.3360000000000001]
["70,設定なし,-1",-1,1.27]
["70,設定なし,-2",-2,1.2050000000000001]
["70,設定なし,-3",-3,1.139]
["70,設定なし,-4",-4,1.0740000000000001]
["70,設定なし,-5",-5,1.008]
["70,設定なし,-6",-6,0.94299999999999995]
["70,設定なし,-7",-7,0.877]
["70,設定なし,-8",-8,0.81200000000000006]
["70,設定なし,-9",-9,0.746]
["70,設定なし,-10",-10,0.66800000000000004]
["60,設定なし,10",10,1.6020000000000001]
["60,設定なし,9",9,1.083]
["60,設定なし,8",8,1.046]
["60,設定なし,7",7,1.0089999999999999]
["60,設定なし,6",6,0.97199999999999998]
["60,設定なし,5",5,0.93500000000000005]
["60,設定なし,4",4,0.89800000000000002]
["60,設定なし,3",3,0.86199999999999999]
["60,設定なし,2",2,0.82499999999999996]
["60,設定なし,1",1,0.78800000000000003]
["60,設定なし,0",0,0.751]
["60,設定なし,-1",-1,0.71399999999999997]
["60,設定なし,-2",-2,0.67700000000000005]
["60,設定なし,-3",-3,0.64]
["60,設定なし,-4",-4,0.60399999999999998]
["60,設定なし,-5",-5,0.56699999999999995]
["60,設定なし,-6",-6,0.53]
["60,設定なし,-7",-7,0.49299999999999999]
["60,設定なし,-8",-8,0.45600000000000002]
["60,設定なし,-9",-9,0.41899999999999998]
["60,設定なし,-10",-10,0.376]
["50,設定なし,10",10,0.96199999999999997]
["50,設定なし,9",9,0.65]
["50,設定なし,8",8,0.628]
["50,設定なし,7",7,0.60599999999999998]
["50,設定なし,6",6,0.58399999999999996]
["50,設定なし,5",5,0.56200000000000006]
["50,設定なし,4",4,0.53900000000000003]
["50,設定なし,3",3,0.51700000000000002]
["50,設定なし,2",2,0.495]
{"$rows_left_out":264}